{"text_format":"1","workbook":"xlsx","n_sheets":11,"sheets":["0. PCMAF front page","0.1 Acknowledgements","1. Introduction","2. User instructions","3. Model front page","4. Maturity assessment","5. Dashboard","6. Improvement action plan","7. Acronyms","Data Lookup Sheet","Calculations"],"not_rendered":{"charts":9,"images":3,"macros":1,"external_links":2,"defined_names":25,"comments":0,"pivot_tables":0},"unopened":[],"bounds":{"document_bytes":16777216,"sheet_cells":100000,"rows_first":2000,"rows_last":500,"rows_between":2000,"halvings":0,"cell_chars":16384,"cell_head_chars":4096},"cells_cut":0,"cells_raw":0,"read":"whole","date_system":"1900"}

{"sheet":"0. PCMAF front page","index":0,"n_rows":0,"n_cols":0,"rows_kept":0,"cut":false,"hidden":false,"merged":[]}

{"sheet":"0.1 Acknowledgements","index":1,"n_rows":0,"n_cols":0,"rows_kept":0,"cut":false,"hidden":false,"merged":[]}

{"sheet":"1. Introduction","index":2,"n_rows":21,"n_cols":3,"rows_kept":21,"cut":false,"hidden":false,"merged":[]}
[]
[]
[]
[]
[]
[]
[]
[null,null,"For assistance using this tool, or to suggest improvements, please contact the APM Planning, Monitoring and Control (PM&C) \nSIG chair or committee member. Contact details of the SIG committees can be found on the APM website below."]
[null,null,"apm.org.uk/community/planning-monitoring-and-control-sig"]
[]
{"$rows_left_out":12}
{"sheet":"2. User instructions","index":3,"n_rows":23,"n_cols":3,"rows_kept":23,"cut":false,"hidden":false,"merged":[]}
[]
[]
[]
[]
[null,null,"For assistance using this tool, or to suggest improvements, please contact the APM Planning, Monitoring and Control (PM&C) \nSIG chair or committee member. Contact details of the SIG committees can be found on the APM website."]
[]
[null,null,"The assessment process"]
[null,null,"There is no single right way to perform the assessment using the maturity grid; the primary factor that determines the right approach for your organisation is the desired outcome from the assessment exercise.  Different approaches deliver different benefits.  Whichever approach is used, the key point to remember is that assessment is about the continual improvement of your project or organisation.  \n\nThe greatest value will be achieved from an assessment if it involves someone who has a working knowledge of the implementation and operation of a project control system.  This ensures that the assessment can be completed with an understanding of the nuances between the different maturity levels for each of the attributes that are scored.\n\nThe assessment can be performed in a number of different ways:\n§ Self-assessment from within the project.\n§ Independent assessment – by reviewers external to the project.\n\nWhile the assessment is valuable, the most critical phase of the process is the post-assessment action planning and implementation. "]
[]
[null,null,"Model front page"]
{"$rows_left_out":14}
{"sheet":"3. Model front page","index":4,"n_rows":39,"n_cols":9,"rows_kept":39,"cut":false,"hidden":false,"merged":[[38,3,38,17],[2,1,3,19],[37,7,37,13],[11,2,11,7],[10,2,10,7],[9,2,9,7],[8,2,8,7],[7,2,7,7],[11,8,11,11],[10,8,10,11],[9,8,9,11],[8,8,8,11],[7,8,7,11]]}
[]
[]
[]
[]
[]
[]
[]
[null,null,"PROJECT TITLE:",null,null,null,null,null,"Super-Duper Project"]
[null,null,"PROJECT MANAGER:",null,null,null,null,null,"A. N. Other"]
[null,null,"PROJECT CONTROL PROJECT LEAD:",null,null,null,null,null,"Clever 1"]
{"$rows_left_out":30}
{"sheet":"4. Maturity assessment","index":5,"n_rows":69,"n_cols":16,"rows_kept":69,"cut":false,"hidden":false,"merged":[[26,4,26,5],[51,4,51,5],[45,4,45,5],[37,4,37,5],[63,4,63,5],[57,4,57,5],[58,2,62,2],[64,2,68,2],[26,2,26,3],[37,2,37,3],[38,2,44,2],[45,2,45,3],[46,2,50,2],[51,2,51,3],[57,2,57,3],[63,2,63,3],[6,4,6,5],[2,10,3,10],[15,4,15,5],[2,2,2,7],[15,2,15,3],[16,2,25,2],[27,2,36,2],[52,2,56,2],[5,2,5,3],[6,2,6,3],[7,2,14,2]]}
[]
[]
[null,null,"  Project Control Maturity Assessment Framework ",null,null,null,null,null,"Assessment\ncompleted:",{"$f":"'3. Model front page'!I12","v":"2018-05-09"}]
[null,null,null,null,null,null,null,null,"PROJECT TITLE:",{"$f":"VLOOKUP(I4,'3. Model front page'!C:I,7,0)","v":"Super-Duper Project"}]
[]
[null,null,"Maturity area",null,"Maturity statements","Typical evidence\n (not all listed items needed in every instance. For examples of typical evidence tools and templates, please refer to the APM website)","Current maturity level","Target maturity \nlevel","Date to meet target level","Comments including evidence",null,null,null,null,"Show/Hide"]
[null,null,"Stage 0 - Culture and environment",null,"The organisational culture and environment that projects are delivered within have a significant impact on the ability to establish effective project controls that facilitate successful project delivery.",null,null,null,null,null,"Stage 0 - Culture & Environment",null,null,null,{"$f":"Stage0Show","v":"show"}]
[null,null,"Stage 0 - Culture and environment","PCS sponsorship","The Project Control System (PCS) Sponsor provides strategic and visible support, establishing clear direction across the organisation and its supply chains.","The following are available and can be demonstrated by the project team: \n\n§ Communications strategy and plan for engagement of sponsor on the project.\n§ Evidence of engagement of sponsor with the project's internal and external stakeholders in relation to project controls, including formal communications and attendance at reviews.\n§ Ongoing assessment of the PCS value and benefits, including monitoring improvement actions where required.\n",null,null,null,null,"Stage 0 - Culture & Environment",null,null,null,"show","Data"]
[null,null,null,"Project stakeholder engagement","All stakeholders are engaged in the Project Control processes and their application throughout the project life cycle.","The following are available and can be demonstrated by the project team: \n\n§ Stakeholder Management Plan documented and applied, and stakeholders engaged with project reviews/events as identified in the Plan.\n§ Communication Plan documented, including planned communications, and evidence that planned communications are being delivered.\n§ Project management and all other applicable functions clearly engaged in importance of applying PCS.",null,null,null,null,"Stage 0 - Culture & Environment",null,null,null,"show","Data"]
[null,null,null,"Project control roles","The project controllers are embedded and integrated into the project team with fully defined roles and responsibilities. They are actively involved in influencing project decisions.","The following are available and can be demonstrated by the project team: \n\n§ Documented roles and responsibilities (terms of reference/role descriptions) for project control staff and project staff with project control responsibilities.\n§ Clear evidence that project controllers are included in all appropriate project meetings and reviews, including via formal meeting terms of reference and attendance lists.\n§ Integration and understanding of all stakeholders interfacing with the PCS.\n",null,null,null,null,"Stage 0 - Culture & Environment",null,null,null,"show","Data"]
{"$rows_left_out":60}
{"sheet":"5. Dashboard","index":6,"n_rows":0,"n_cols":0,"rows_kept":0,"cut":false,"hidden":false,"merged":[]}

{"sheet":"6. Improvement action plan","index":7,"n_rows":43,"n_cols":14,"rows_kept":43,"cut":false,"hidden":false,"merged":[[8,3,8,4],[9,3,9,4]]}
[]
[]
[]
[]
[]
[]
[]
[]
[null,null,"PROJECT TITLE:",{"$f":"VLOOKUP(C9,'3. Model front page'!C:I,7,I90)","v":"Super-Duper Project"}]
[null,null,"PROJECT MANAGER:",{"$f":"VLOOKUP(C10,'3. Model front page'!C:I,7,0)","v":"A. N. Other"}]
{"$rows_left_out":34}
{"sheet":"7. Acronyms","index":8,"n_rows":34,"n_cols":5,"rows_kept":34,"cut":false,"hidden":false,"merged":[[6,2,6,3]]}
[]
[]
[]
[]
[]
[]
[null,null,"Acronyms",null,"Definitions"]
[null,null,"AC","Actual cost","The incurred costs that are charged to the project budget and for which payment has been made, or accrued."]
[null,null,"BAC","Budget at completion","The sum total of the time-phased budgets."]
[null,null,"BoM","Bill of materials","The management of purchased materials/ services covers the processes and activities that directly affect the purchase of bill of materials items or services from external suppliers."]
{"$rows_left_out":25}
{"sheet":"Data Lookup Sheet","index":9,"n_rows":62,"n_cols":13,"rows_kept":62,"cut":false,"hidden":true,"merged":[]}
["Project Stages",null,"Maturity Assessment","Scores",null,"Dark Green",null,null,"Stage 0","show",null,"PCS Sponsorship","Stage 0 - Culture & Environment"]
["Stage 0 - Culture & Environment",null,"True",5,null,"Light Green",null,null,"Stage 1","show",null,"Project Stakeholder Engagement","Stage 0 - Culture & Environment"]
["Stage 1 - Organisation",null,"More true than untrue",3,null,"Amber",null,null,"Stage 2","show",null,"Project Control Roles","Stage 0 - Culture & Environment"]
["Stage 2 - Scheduling & Resourcing",null,"More untrue than true",1,null,"Red",null,null,"Stage 3","show",null,"Project Control Competencies","Stage 0 - Culture & Environment"]
["Stage 3 - Budgeting & Work Authorisation",null,"Untrue",0,null,"Grey",null,null,"Stage 4","show",null,"Project Control System Application","Stage 0 - Culture & Environment"]
["Stage 4 - Management of Purchased Materials / Services",null,"N/A",null,null,"Blue",null,null,"Stage 5","show",null,"Project Control System Reviews","Stage 0 - Culture & Environment"]
["Stage 5 - Accounting",null,"Not Yet Assessed",null,null,null,null,null,"Stage 6","show",null,"Continuous Improvement & Learning","Stage 0 - Culture & Environment"]
["Stage 6 - Managerial Analysis",null,null,null,null,null,null,null,"Stage 7","show",null,"Project Closure","Stage 0 - Culture & Environment"]
["Stage 7 - Change Control",null,null,null,null,"Ongoing"]
[null,null,"Version for VLOOKUP","Scores",null,"Slipping",null,null,null,null,null,"Scope Definition ","Stage 1 - Organisation"]
{"$rows_left_out":53}
{"sheet":"Calculations","index":10,"n_rows":77,"n_cols":20,"rows_kept":77,"cut":false,"hidden":true,"merged":[[0,7,0,12],[0,13,0,19]]}
["Data Date",{"$f":"'4. Maturity assessment'!J3","v":"2018-05-09"},null,null,null,null,null,"Graph Data",null,null,null,null,null,"Further Analysis"]
[{"$f":"'4. Maturity assessment'!C7","v":"Stage 0 - Culture and environment"},"Model - Current","Model - Target","Target Date","Score - Current","Score - Target",null,"Target Met","On Target","Late","Target","Target Not Applicable","Target Not Yet Assessed","Over Achieved","Achieved","Late","On Target","N/A","Not Assessed","Within 1 Month"]
[{"$f":"'4. Maturity assessment'!D8","v":"PCS sponsorship"},{"$f":"'4. Maturity assessment'!G8","v":0},{"$f":"'4. Maturity assessment'!H8","v":0},{"$f":"'4. Maturity assessment'!I8","v":"00:00:00"},{"$f":"VLOOKUP(B3,'Data Lookup Sheet'!$C$11:$D$16,2)","v":{"$error":"#N/A"}},{"$f":"VLOOKUP(C3,'Data Lookup Sheet'!$C$11:$D$16,2)","v":{"$error":"#N/A"}},null,{"$f":"IF(E3>=F3,E3,0)","v":{"$error":"#N/A"}},{"$f":"IF(AND($E3<$F3,$D3>$B$1),$E3,0)","v":{"$error":"#N/A"}},{"$f":"IF(AND($E3<$F3,$D3<=$B$1),$E3,0)","v":{"$error":"#N/A"}},{"$f":"IF(AND(C3<>'Data Lookup Sheet'!$C$6,C3<>'Data Lookup Sheet'!$C$7),F3,NA())","v":{"$error":"#N/A"}},{"$f":"IF(C3='Data Lookup Sheet'!$C$6,0,NA())","v":{"$error":"#N/A"}},{"$f":"IF(C3='Data Lookup Sheet'!$C$7,0,NA())","v":{"$error":"#N/A"}},{"$f":"IF(E3>F3,1,0)","v":{"$error":"#N/A"}},{"$f":"IF(AND(E3=F3,F3<>0),1,0)","v":{"$error":"#N/A"}},{"$f":"IF(AND(F3>E3,D3<$B$1),1,0)","v":{"$error":"#N/A"}},{"$f":"IF(AND(F3>E3,D3>$B$1),1,0)","v":{"$error":"#N/A"}},{"$f":"IF(C3='Data Lookup Sheet'!$C$6,1,0)","v":0},{"$f":"IF(C3='Data Lookup Sheet'!$C$7,1,0)","v":0},{"$f":"IF(AND(Q3<>0,(D3-$B$1)<=30),1,0)","v":{"$error":"#N/A"}}]
[{"$f":"'4. Maturity assessment'!D9","v":"Project stakeholder engagement"},{"$f":"'4. Maturity assessment'!G9","v":0},{"$f":"'4. Maturity assessment'!H9","v":0},{"$f":"'4. Maturity assessment'!I9","v":"00:00:00"},{"$f":"VLOOKUP(B4,'Data Lookup Sheet'!$C$11:$D$16,2)","v":{"$error":"#N/A"}},{"$f":"VLOOKUP(C4,'Data Lookup Sheet'!$C$11:$D$16,2)","v":{"$error":"#N/A"}},null,{"$f":"IF(E4>=F4,E4,0)","v":{"$error":"#N/A"}},{"$f":"IF(AND($E4<$F4,$D4>$B$1),$E4,0)","v":{"$error":"#N/A"}},{"$f":"IF(AND($E4<$F4,$D4<=$B$1),$E4,0)","v":{"$error":"#N/A"}},{"$f":"IF(AND(C4<>'Data Lookup Sheet'!$C$6,C4<>'Data Lookup Sheet'!$C$7),F4,NA())","v":{"$error":"#N/A"}},{"$f":"IF(C4='Data Lookup Sheet'!$C$6,0,NA())","v":{"$error":"#N/A"}},{"$f":"IF(C4='Data Lookup Sheet'!$C$7,0,NA())","v":{"$error":"#N/A"}},{"$f":"IF(E4>F4,1,0)","v":{"$error":"#N/A"}},{"$f":"IF(AND(E4=F4,F4<>0),1,0)","v":{"$error":"#N/A"}},{"$f":"IF(AND(F4>E4,D4<$B$1),1,0)","v":{"$error":"#N/A"}},{"$f":"IF(AND(F4>E4,D4>$B$1),1,0)","v":{"$error":"#N/A"}},{"$f":"IF(C4='Data Lookup Sheet'!$C$6,1,0)","v":0},{"$f":"IF(C4='Data Lookup Sheet'!$C$7,1,0)","v":0},{"$f":"IF(AND(Q4<>0,(D4-$B$1)<=30),1,0)","v":{"$error":"#N/A"}}]
[{"$f":"'4. Maturity assessment'!D10","v":"Project control roles"},{"$f":"'4. Maturity assessment'!G10","v":0},{"$f":"'4. Maturity assessment'!H10","v":0},{"$f":"'4. Maturity assessment'!I10","v":"00:00:00"},{"$f":"VLOOKUP(B5,'Data Lookup Sheet'!$C$11:$D$16,2)","v":{"$error":"#N/A"}},{"$f":"VLOOKUP(C5,'Data Lookup Sheet'!$C$11:$D$16,2)","v":{"$error":"#N/A"}},null,{"$error":"#N/A"},{"$error":"#N/A"},{"$error":"#N/A"},{"$f":"IF(AND(C5<>'Data Lookup Sheet'!$C$6,C5<>'Data Lookup Sheet'!$C$7),F5,NA())","v":{"$error":"#N/A"}},{"$f":"IF(C5='Data Lookup Sheet'!$C$6,0,NA())","v":{"$error":"#N/A"}},{"$f":"IF(C5='Data Lookup Sheet'!$C$7,0,NA())","v":{"$error":"#N/A"}},{"$error":"#N/A"},{"$error":"#N/A"},{"$error":"#N/A"},{"$error":"#N/A"},{"$f":"IF(C5='Data Lookup Sheet'!$C$6,1,0)","v":0},{"$f":"IF(C5='Data Lookup Sheet'!$C$7,1,0)","v":0},{"$error":"#N/A"}]
[{"$f":"'4. Maturity assessment'!D11","v":"Project control competencies"},{"$f":"'4. Maturity assessment'!G11","v":0},{"$f":"'4. Maturity assessment'!H11","v":0},{"$f":"'4. Maturity assessment'!I11","v":"00:00:00"},{"$f":"VLOOKUP(B6,'Data Lookup Sheet'!$C$11:$D$16,2)","v":{"$error":"#N/A"}},{"$f":"VLOOKUP(C6,'Data Lookup Sheet'!$C$11:$D$16,2)","v":{"$error":"#N/A"}},null,{"$error":"#N/A"},{"$error":"#N/A"},{"$error":"#N/A"},{"$f":"IF(AND(C6<>'Data Lookup Sheet'!$C$6,C6<>'Data Lookup Sheet'!$C$7),F6,NA())","v":{"$error":"#N/A"}},{"$f":"IF(C6='Data Lookup Sheet'!$C$6,0,NA())","v":{"$error":"#N/A"}},{"$f":"IF(C6='Data Lookup Sheet'!$C$7,0,NA())","v":{"$error":"#N/A"}},{"$error":"#N/A"},{"$error":"#N/A"},{"$error":"#N/A"},{"$error":"#N/A"},{"$f":"IF(C6='Data Lookup Sheet'!$C$6,1,0)","v":0},{"$f":"IF(C6='Data Lookup Sheet'!$C$7,1,0)","v":0},{"$error":"#N/A"}]
[{"$f":"'4. Maturity assessment'!D12","v":"Project control system application and assurance"},{"$f":"'4. Maturity assessment'!G12","v":0},{"$f":"'4. Maturity assessment'!H12","v":0},{"$f":"'4. Maturity assessment'!I12","v":"00:00:00"},{"$f":"VLOOKUP(B7,'Data Lookup Sheet'!$C$11:$D$16,2)","v":{"$error":"#N/A"}},{"$f":"VLOOKUP(C7,'Data Lookup Sheet'!$C$11:$D$16,2)","v":{"$error":"#N/A"}},null,{"$error":"#N/A"},{"$error":"#N/A"},{"$error":"#N/A"},{"$f":"IF(AND(C7<>'Data Lookup Sheet'!$C$6,C7<>'Data Lookup Sheet'!$C$7),F7,NA())","v":{"$error":"#N/A"}},{"$f":"IF(C7='Data Lookup Sheet'!$C$6,0,NA())","v":{"$error":"#N/A"}},{"$f":"IF(C7='Data Lookup Sheet'!$C$7,0,NA())","v":{"$error":"#N/A"}},{"$error":"#N/A"},{"$error":"#N/A"},{"$error":"#N/A"},{"$error":"#N/A"},{"$f":"IF(C7='Data Lookup Sheet'!$C$6,1,0)","v":0},{"$f":"IF(C7='Data Lookup Sheet'!$C$7,1,0)","v":0},{"$error":"#N/A"}]
[{"$f":"'4. Maturity assessment'!D13","v":"Project control system reviews"},{"$f":"'4. Maturity assessment'!G13","v":0},{"$f":"'4. Maturity assessment'!H13","v":0},{"$f":"'4. Maturity assessment'!I13","v":"00:00:00"},{"$f":"VLOOKUP(B8,'Data Lookup Sheet'!$C$11:$D$16,2)","v":{"$error":"#N/A"}},{"$f":"VLOOKUP(C8,'Data Lookup Sheet'!$C$11:$D$16,2)","v":{"$error":"#N/A"}},null,{"$error":"#N/A"},{"$error":"#N/A"},{"$error":"#N/A"},{"$f":"IF(AND(C8<>'Data Lookup Sheet'!$C$6,C8<>'Data Lookup Sheet'!$C$7),F8,NA())","v":{"$error":"#N/A"}},{"$f":"IF(C8='Data Lookup Sheet'!$C$6,0,NA())","v":{"$error":"#N/A"}},{"$f":"IF(C8='Data Lookup Sheet'!$C$7,0,NA())","v":{"$error":"#N/A"}},{"$error":"#N/A"},{"$error":"#N/A"},{"$error":"#N/A"},{"$error":"#N/A"},{"$f":"IF(C8='Data Lookup Sheet'!$C$6,1,0)","v":0},{"$f":"IF(C8='Data Lookup Sheet'!$C$7,1,0)","v":0},{"$error":"#N/A"}]
[{"$f":"'4. Maturity assessment'!D14","v":"Continuous improvement and learning"},{"$f":"'4. Maturity assessment'!G14","v":0},{"$f":"'4. Maturity assessment'!H14","v":0},{"$f":"'4. Maturity assessment'!I14","v":"00:00:00"},{"$f":"VLOOKUP(B9,'Data Lookup Sheet'!$C$11:$D$16,2)","v":{"$error":"#N/A"}},{"$f":"VLOOKUP(C9,'Data Lookup Sheet'!$C$11:$D$16,2)","v":{"$error":"#N/A"}},null,{"$error":"#N/A"},{"$error":"#N/A"},{"$error":"#N/A"},{"$f":"IF(AND(C9<>'Data Lookup Sheet'!$C$6,C9<>'Data Lookup Sheet'!$C$7),F9,NA())","v":{"$error":"#N/A"}},{"$f":"IF(C9='Data Lookup Sheet'!$C$6,0,NA())","v":{"$error":"#N/A"}},{"$f":"IF(C9='Data Lookup Sheet'!$C$7,0,NA())","v":{"$error":"#N/A"}},{"$error":"#N/A"},{"$error":"#N/A"},{"$error":"#N/A"},{"$error":"#N/A"},{"$f":"IF(C9='Data Lookup Sheet'!$C$6,1,0)","v":0},{"$f":"IF(C9='Data Lookup Sheet'!$C$7,1,0)","v":0},{"$error":"#N/A"}]
[{"$f":"'4. Maturity assessment'!D15","v":"Project closure"},{"$f":"'4. Maturity assessment'!G15","v":0},{"$f":"'4. Maturity assessment'!H15","v":0},{"$f":"'4. Maturity assessment'!I15","v":"00:00:00"},{"$f":"VLOOKUP(B10,'Data Lookup Sheet'!$C$11:$D$16,2)","v":{"$error":"#N/A"}},{"$f":"VLOOKUP(C10,'Data Lookup Sheet'!$C$11:$D$16,2)","v":{"$error":"#N/A"}},null,{"$error":"#N/A"},{"$error":"#N/A"},{"$error":"#N/A"},{"$f":"IF(AND(C10<>'Data Lookup Sheet'!$C$6,C10<>'Data Lookup Sheet'!$C$7),F10,NA())","v":{"$error":"#N/A"}},{"$f":"IF(C10='Data Lookup Sheet'!$C$6,0,NA())","v":{"$error":"#N/A"}},{"$f":"IF(C10='Data Lookup Sheet'!$C$7,0,NA())","v":{"$error":"#N/A"}},{"$error":"#N/A"},{"$error":"#N/A"},{"$error":"#N/A"},{"$error":"#N/A"},{"$f":"IF(C10='Data Lookup Sheet'!$C$6,1,0)","v":0},{"$f":"IF(C10='Data Lookup Sheet'!$C$7,1,0)","v":0},{"$error":"#N/A"}]
{"$rows_left_out":67}